{"text_format":"1","workbook":"xlsx","n_sheets":7,"sheets":["Information","Betriebsdaten","Anlage - Stickstoff","Anlage - Gülle-Jaucheanfall","Rechnung","Stickstoffdaten","Gülle-Jaucheanfall-Daten"],"not_rendered":{"charts":0,"images":1,"macros":1,"external_links":0,"defined_names":11,"comments":0,"pivot_tables":0},"unopened":[],"bounds":{"document_bytes":16777216,"sheet_cells":100000,"rows_first":2000,"rows_last":500,"rows_between":2000,"halvings":0,"cell_chars":16384,"cell_head_chars":4096},"cells_cut":0,"cells_raw":0,"read":"whole","date_system":"1900"}

{"sheet":"Information","index":0,"n_rows":56,"n_cols":10,"rows_kept":56,"cut":false,"hidden":false,"merged":[[16,2,20,9],[51,5,51,6],[51,7,51,9],[52,2,52,4],[52,7,52,8],[22,2,23,9],[34,2,44,9],[1,2,1,5],[1,9,1,10],[2,2,2,5],[2,9,2,10],[55,2,55,4],[55,7,55,9],[53,2,53,4],[3,2,3,7],[25,2,28,9],[29,2,32,9],[54,2,54,4],[45,2,47,9],[10,2,15,9],[51,2,51,4],[5,2,5,9],[6,2,8,9]]}
[]
[null,null,"Ministerium für Landwirtschaft",null,null,null,null,null,null,"Mecklenburg"]
[null,null,"Umwelt und Verbraucherschutz",null,null,null,null,null,null,"Vorpommern"]
[null,null,"Fachinformation der LMS Landwirtschaftsberatung Zust. Stelle für Landwirtschaftl. Fachrecht u. Beratung"]
[]
[null,null,"Berechnung des Stickstoffanfalls                                                                                                  zur Kontrolle der Einhaltung der 170 kg/ha N nach DüV                                                                                                                                                                         mit Wirtschaftsdüngern tierischer Herkunft"]
[null,null,"Im Regelfall dürfen auf den bewirtschafteten landwirtschaftlichen Flächen im Durchschnitt eines Betriebes nur maximal 170 kg N/ha aus tierischen Wirtschaftsdüngern ausgebracht werden. Die Ausnahme – maximal 230 kg N/ha für intensiv bewirtschaftetes Grünland oder Feldgras - kann  unter Berücksichtigung weiterer zusätzlicher Auflagen bei den zuständigen Behörden beantragt werden.\n\n"]
[]
[]
[]
[null,null,"Mit der bereitgestellten Kalkulationstabelle können Sie für Ihren Betrieb berechnen,                                                                                                                                                            - ob die Grenze der Düngeverordnung von 170 kg/ha N eingehalten wird,                                                                                    - wie viel Stickstoff über Wirtschaftsdünger aus dem Betrieb zur Einhaltung der 170 kg/ha N abzugeben wäre,                                                                                                                                                       - wie viel Stickstoff aus Wirtschaftsdüngern von anderen Betrieben noch aufgenommen werden könnte, \n- in welchem Umfang der Viehbestand entsprechend der Flächenausstatung zu reduzieren wäre,                                                                                    - in welchem Maße die Flächenausstattung zu erweitern wäre, um den aktuellen Viehbestand zu halten.     (Füllen Sie hierzu bitte die Anlage-Stickstoff aus.)                     \n"]
[]
[]
[]
[]
[]
[null,null,"Bei der Nutzung der Kalkukationstabelle ist zu beachten, dass die Tierartengruppen aus der \"Anlage Tier-haltung zum Sammelantrag für Antragsteller aus Mecklenburg-Vorpommern\" übernommen werden können. Wenn die Tierartengruppen durch den Betrieb entsprechend den betrieblichen Haltungsformen oder der Fütterung weiter untersetzt werden können, ist es möglich, eine detailiertere Einordnung der einzelnen Tierartengruppen (nach rechts eingerückt) vorzunehmen. "]
[]
[]
[]
{"$rows_left_out":37}
{"sheet":"Betriebsdaten","index":1,"n_rows":59,"n_cols":9,"rows_kept":59,"cut":false,"hidden":false,"merged":[[4,1,4,5],[3,1,3,3],[2,6,2,7],[3,6,3,7],[35,2,35,6],[11,3,11,7],[13,3,13,7],[15,3,15,7],[17,3,17,7],[26,4,26,6],[19,3,19,7],[21,3,21,4],[21,6,21,7],[33,2,34,5],[32,1,32,2],[26,1,26,3],[22,3,22,4],[22,6,22,7],[24,3,24,7],[29,2,30,5],[48,1,48,6],[39,1,39,2],[37,1,37,2],[42,1,42,4],[43,1,43,5],[45,1,45,5],[46,1,46,6],[41,1,41,4],[47,1,47,5]]}
[]
[]
[null,"Ministerium für Landwirtschaft,",null,null,null,null,"Mecklenburg"]
[null,"Umwelt und Verbraucherschutz",null,null,null,null,"Vorpommern"]
[null,"Fachinformation der LMS Landwirtschaftsberatung Zust. Stelle für Landwirtschaftl. Fachrecht u. Beratung"]
[]
[null,"Ermittlung des Stickstoffanfalls aus  Wirtschaftsdüngern tierischer Art"]
[null,"und des Lagerraumbedarfs für flüssige Wirtschaftsdünger",null,null,null,null,null,{"$f":"TODAY()","v":"2023-09-27"}]
[null,"(Füllen Sie hierzu bitte zusätzlich die Anlagen 1 und 2 aus)"]
[null,"Daten eingeben",null,"Daten werden berechnet"]
[]
[null,"Betriebs-Nr.:"]
[]
[null,"Name des Betriebes"]
[]
[null,"Straße"]
[]
[null,"PLZ/Ort"]
[]
[null,"Ansprechpartner"]
{"$rows_left_out":40}
{"sheet":"Anlage - Stickstoff","index":2,"n_rows":145,"n_cols":15,"rows_kept":145,"cut":false,"hidden":false,"merged":[[0,1,0,7],[35,1,35,2],[34,1,34,2],[36,1,36,2],[1,1,1,2],[3,1,3,2],[2,1,2,2],[34,6,34,7],[1,6,1,7],[1,8,1,11],[2,6,2,7],[2,8,2,9],[2,10,2,11],[37,1,37,2],[30,1,30,2],[31,1,31,2],[32,1,32,2],[33,1,33,2]]}
[null,"Anlage 1: Datenerfassung für den Stickstoffanfall aus Wirtschaftsdüngern tierischer Herkunft"]
[null,"Tierartengruppe (bitte durch klicken auf die Felder wählen)",null,null,null,null,"Tierbestand ",null,"N-Anfall aus tierischen Wirtschaftsdüngern"]
[null,null,null,null,"Einheit","N","Plätze",null,"N-Brutto",null,"N-Netto"]
[null,"Spalte B=Tierartengruppe          Spalte C=Untersetzung",null,null,null,"kg/Einheit","auf        Gülle","auf Stalldung","aus  Gülle","aus Stalldung","aus  Gülle","aus Stalldung"]
[null,null,null,{"$f":"IF(C5=\"\",1,VLOOKUP(C5,Stickstoffdaten!$A$7:$B$212,2,FALSE))","v":1},{"$f":"VLOOKUP($D5,Stickstoffdaten!$B$6:$D$212,2)","v":"kg/Platz"},{"$f":"VLOOKUP($D5,Stickstoffdaten!$B$6:$D$212,3)","v":0},null,null,{"$f":"IF(D5<139,ROUND(F5*G5,1),0)","v":0},{"$f":"IF(D5<139,ROUND(F5*H5,1),ROUND((G5+H5)*F5,1))","v":0},{"$f":"IF(I5>0,ROUND(I5*N5,1),0)","v":0},0,null,{"$f":"VLOOKUP($D5,Stickstoffdaten!$B$6:$F$212,4)","v":0},{"$f":"VLOOKUP($D5,Stickstoffdaten!$B$6:$F$210,5)","v":0}]
[null,null,null,{"$f":"IF(C6=\"\",1,VLOOKUP(C6,Stickstoffdaten!$A$7:$B$212,2,FALSE))","v":1},{"$f":"VLOOKUP($D6,Stickstoffdaten!$B$6:$D$210,2)","v":"kg/Platz"},{"$f":"VLOOKUP($D6,Stickstoffdaten!$B$6:$D$212,3)","v":0},null,null,{"$f":"IF(D6<139,ROUND(F6*G6,1),0)","v":0},{"$f":"IF(D6<139,ROUND(F6*H6,1),ROUND((G6+H6)*F6,1))","v":0},0,0,null,{"$f":"VLOOKUP($D6,Stickstoffdaten!$B$6:$F$212,4)","v":0},{"$f":"VLOOKUP($D6,Stickstoffdaten!$B$6:$F$210,5)","v":0}]
[null,null,null,{"$f":"IF(C7=\"\",1,VLOOKUP(C7,Stickstoffdaten!$A$7:$B$212,2,FALSE))","v":1},{"$f":"VLOOKUP($D7,Stickstoffdaten!$B$6:$D$210,2)","v":"kg/Platz"},{"$f":"VLOOKUP($D7,Stickstoffdaten!$B$6:$D$212,3)","v":0},null,null,0,0,0,0,null,{"$f":"VLOOKUP($D7,Stickstoffdaten!$B$6:$F$212,4)","v":0},{"$f":"VLOOKUP($D7,Stickstoffdaten!$B$6:$F$210,5)","v":0}]
[null,null,null,{"$f":"IF(C8=\"\",1,VLOOKUP(C8,Stickstoffdaten!$A$7:$B$212,2,FALSE))","v":1},{"$f":"VLOOKUP($D8,Stickstoffdaten!$B$6:$D$210,2)","v":"kg/Platz"},{"$f":"VLOOKUP($D8,Stickstoffdaten!$B$6:$D$212,3)","v":0},null,null,0,0,{"$f":"IF(I8>0,ROUND(I8*N8,1),0)","v":0},{"$f":"IF(J8>0,ROUND(J8*O8,1),0)","v":0},null,{"$f":"VLOOKUP($D8,Stickstoffdaten!$B$6:$F$212,4)","v":0},{"$f":"VLOOKUP($D8,Stickstoffdaten!$B$6:$F$210,5)","v":0}]
[null,null,null,{"$f":"IF(C9=\"\",1,VLOOKUP(C9,Stickstoffdaten!$A$7:$B$212,2,FALSE))","v":1},{"$f":"VLOOKUP($D9,Stickstoffdaten!$B$6:$D$210,2)","v":"kg/Platz"},{"$f":"VLOOKUP($D9,Stickstoffdaten!$B$6:$D$212,3)","v":0},null,null,0,0,0,0,null,{"$f":"VLOOKUP($D9,Stickstoffdaten!$B$6:$F$212,4)","v":0},{"$f":"VLOOKUP($D9,Stickstoffdaten!$B$6:$F$210,5)","v":0}]
[null,null,null,{"$f":"IF(C10=\"\",1,VLOOKUP(C10,Stickstoffdaten!$A$7:$B$212,2,FALSE))","v":1},{"$f":"VLOOKUP($D10,Stickstoffdaten!$B$6:$D$210,2)","v":"kg/Platz"},{"$f":"VLOOKUP($D10,Stickstoffdaten!$B$6:$D$212,3)","v":0},null,null,0,0,0,0,null,{"$f":"VLOOKUP($D10,Stickstoffdaten!$B$6:$F$212,4)","v":0},{"$f":"VLOOKUP($D10,Stickstoffdaten!$B$6:$F$210,5)","v":0}]
[null,null,null,{"$f":"IF(C11=\"\",1,VLOOKUP(C11,Stickstoffdaten!$A$7:$B$212,2,FALSE))","v":1},{"$f":"VLOOKUP($D11,Stickstoffdaten!$B$6:$D$210,2)","v":"kg/Platz"},{"$f":"VLOOKUP($D11,Stickstoffdaten!$B$6:$D$212,3)","v":0},null,null,0,0,0,0,null,{"$f":"VLOOKUP($D11,Stickstoffdaten!$B$6:$F$212,4)","v":0},{"$f":"VLOOKUP($D11,Stickstoffdaten!$B$6:$F$210,5)","v":0}]
[null,null,null,{"$f":"IF(C12=\"\",1,VLOOKUP(C12,Stickstoffdaten!$A$7:$B$212,2,FALSE))","v":1},{"$f":"VLOOKUP($D12,Stickstoffdaten!$B$6:$D$210,2)","v":"kg/Platz"},{"$f":"VLOOKUP($D12,Stickstoffdaten!$B$6:$D$212,3)","v":0},null,null,0,0,0,0,null,{"$f":"VLOOKUP($D12,Stickstoffdaten!$B$6:$F$212,4)","v":0},{"$f":"VLOOKUP($D12,Stickstoffdaten!$B$6:$F$210,5)","v":0}]
[null,null,null,{"$f":"IF(C13=\"\",1,VLOOKUP(C13,Stickstoffdaten!$A$7:$B$212,2,FALSE))","v":1},{"$f":"VLOOKUP($D13,Stickstoffdaten!$B$6:$D$210,2)","v":"kg/Platz"},{"$f":"VLOOKUP($D13,Stickstoffdaten!$B$6:$D$212,3)","v":0},null,null,0,0,0,0,null,{"$f":"VLOOKUP($D13,Stickstoffdaten!$B$6:$F$212,4)","v":0},{"$f":"VLOOKUP($D13,Stickstoffdaten!$B$6:$F$210,5)","v":0}]
[null,null,null,{"$f":"IF(C14=\"\",1,VLOOKUP(C14,Stickstoffdaten!$A$7:$B$212,2,FALSE))","v":1},{"$f":"VLOOKUP($D14,Stickstoffdaten!$B$6:$D$210,2)","v":"kg/Platz"},{"$f":"VLOOKUP($D14,Stickstoffdaten!$B$6:$D$212,3)","v":0},null,null,0,0,0,0,null,{"$f":"VLOOKUP($D14,Stickstoffdaten!$B$6:$F$212,4)","v":0},{"$f":"VLOOKUP($D14,Stickstoffdaten!$B$6:$F$210,5)","v":0}]
[null,null,null,{"$f":"IF(C15=\"\",1,VLOOKUP(C15,Stickstoffdaten!$A$7:$B$212,2,FALSE))","v":1},{"$f":"VLOOKUP($D15,Stickstoffdaten!$B$6:$D$210,2)","v":"kg/Platz"},{"$f":"VLOOKUP($D15,Stickstoffdaten!$B$6:$D$212,3)","v":0},null,null,0,0,0,0,null,{"$f":"VLOOKUP($D15,Stickstoffdaten!$B$6:$F$212,4)","v":0},{"$f":"VLOOKUP($D15,Stickstoffdaten!$B$6:$F$210,5)","v":0}]
[null,null,null,{"$f":"IF(C16=\"\",1,VLOOKUP(C16,Stickstoffdaten!$A$7:$B$212,2,FALSE))","v":1},{"$f":"VLOOKUP($D16,Stickstoffdaten!$B$6:$D$210,2)","v":"kg/Platz"},{"$f":"VLOOKUP($D16,Stickstoffdaten!$B$6:$D$212,3)","v":0},null,null,0,0,0,0,null,{"$f":"VLOOKUP($D16,Stickstoffdaten!$B$6:$F$212,4)","v":0},{"$f":"VLOOKUP($D16,Stickstoffdaten!$B$6:$F$210,5)","v":0}]
[null,null,null,{"$f":"IF(C17=\"\",1,VLOOKUP(C17,Stickstoffdaten!$A$7:$B$212,2,FALSE))","v":1},{"$f":"VLOOKUP($D17,Stickstoffdaten!$B$6:$D$210,2)","v":"kg/Platz"},{"$f":"VLOOKUP($D17,Stickstoffdaten!$B$6:$D$212,3)","v":0},null,null,0,0,{"$f":"IF(I17>0,ROUND(I17*N17,1),0)","v":0},{"$f":"IF(J17>0,ROUND(J17*O17,1),0)","v":0},null,{"$f":"VLOOKUP($D17,Stickstoffdaten!$B$6:$F$212,4)","v":0},{"$f":"VLOOKUP($D17,Stickstoffdaten!$B$6:$F$210,5)","v":0}]
[null,null,null,{"$f":"IF(C18=\"\",1,VLOOKUP(C18,Stickstoffdaten!$A$7:$B$212,2,FALSE))","v":1},{"$f":"VLOOKUP($D18,Stickstoffdaten!$B$6:$D$210,2)","v":"kg/Platz"},{"$f":"VLOOKUP($D18,Stickstoffdaten!$B$6:$D$212,3)","v":0},null,null,0,0,0,0,null,{"$f":"VLOOKUP($D18,Stickstoffdaten!$B$6:$F$212,4)","v":0},{"$f":"VLOOKUP($D18,Stickstoffdaten!$B$6:$F$210,5)","v":0}]
[null,null,null,{"$f":"IF(C19=\"\",1,VLOOKUP(C19,Stickstoffdaten!$A$7:$B$212,2,FALSE))","v":1},{"$f":"VLOOKUP($D19,Stickstoffdaten!$B$6:$D$210,2)","v":"kg/Platz"},{"$f":"VLOOKUP($D19,Stickstoffdaten!$B$6:$D$212,3)","v":0},null,null,0,0,0,0,null,{"$f":"VLOOKUP($D19,Stickstoffdaten!$B$6:$F$212,4)","v":0},{"$f":"VLOOKUP($D19,Stickstoffdaten!$B$6:$F$210,5)","v":0}]
[null,null,null,{"$f":"IF(C20=\"\",1,VLOOKUP(C20,Stickstoffdaten!$A$7:$B$212,2,FALSE))","v":1},{"$f":"VLOOKUP($D20,Stickstoffdaten!$B$6:$D$210,2)","v":"kg/Platz"},{"$f":"VLOOKUP($D20,Stickstoffdaten!$B$6:$D$212,3)","v":0},null,null,0,0,0,0,null,{"$f":"VLOOKUP($D20,Stickstoffdaten!$B$6:$F$212,4)","v":0},{"$f":"VLOOKUP($D20,Stickstoffdaten!$B$6:$F$210,5)","v":0}]
{"$rows_left_out":126}
{"sheet":"Anlage - Gülle-Jaucheanfall","index":3,"n_rows":39,"n_cols":17,"rows_kept":39,"cut":false,"hidden":false,"merged":[[36,1,36,2],[37,1,37,2],[38,1,38,2],[0,1,0,6],[32,1,32,2],[33,1,33,2],[34,1,34,2],[35,1,35,2],[28,1,28,2],[29,1,29,2],[30,1,30,2],[31,1,31,2],[1,1,1,2],[2,1,2,2],[3,1,3,2],[27,1,27,2],[1,4,3,4],[1,6,2,6],[1,5,2,5],[3,5,3,6],[1,9,1,10],[1,13,1,16],[2,9,2,10],[2,11,2,12],[2,13,2,14],[2,15,2,16],[1,11,1,12]]}
[null,"Anlage 2: Datenerfassung für den Wirtschaftsdüngeranfall aus Wirtschaftsdüngern tierischer Art"]
[null,"Tierartengruppe (bitte durch klicken auf die Felder wählen)",null,null,"Einheit","Gülle-anfall ","Jauche-anfall","Gülle","Gülle","Tierbestand ",null,"Weidetage",null,"Anfall in 12 Monaten cbm"]
[null,null,null,null,null,null,null,"TM %","TM %","Plätze",null,"Anzahl Tage",null,"brutto",null,"netto (ohne Weide)"]
[null,"Spalte B=Tierartengruppe          Spalte C=Untersetzung",null,null,null,"in 12 Monaten je Stallplatz cbm",null,"Stan-dard","Ist","auf     Gülle","auf Dung","auf     Gülle","auf Dung","Gülle","Jauche","Gülle","Jauche"]
[null,null,null,{"$f":"IF(C5=\"\",1,VLOOKUP(C5,'Gülle-Jaucheanfall-Daten'!$A$7:$B$143,2,FALSE))","v":1},{"$f":"VLOOKUP($D5,'Gülle-Jaucheanfall-Daten'!$B$6:$E$148,2)","v":"cbm/Platz"},{"$f":"VLOOKUP($D5,'Gülle-Jaucheanfall-Daten'!$B$6:$H$148,3)","v":0},{"$f":"VLOOKUP($D5,'Gülle-Jaucheanfall-Daten'!$B$6:$H$148,4)","v":0},{"$f":"VLOOKUP($D5,'Gülle-Jaucheanfall-Daten'!$B$6:$H$148,7)","v":0},null,null,null,null,null,{"$f":"IF(I5>0,ROUND(+F5*J5*H5/I5,1),ROUND(F5*J5,1))","v":0},{"$f":"ROUND(G5*K5,1)","v":0},{"$f":"N5/365*(365-L5)","v":0},{"$f":"ROUND(O5/365*(365-M5),1)","v":0}]
[null,null,null,{"$f":"IF(C6=\"\",1,VLOOKUP(C6,'Gülle-Jaucheanfall-Daten'!$A$7:$B$143,2,FALSE))","v":1},{"$f":"VLOOKUP($D6,'Gülle-Jaucheanfall-Daten'!$B$6:$E$148,2)","v":"cbm/Platz"},{"$f":"VLOOKUP($D6,'Gülle-Jaucheanfall-Daten'!$B$6:$H$148,3)","v":0},{"$f":"VLOOKUP($D6,'Gülle-Jaucheanfall-Daten'!$B$6:$H$148,4)","v":0},{"$f":"VLOOKUP($D6,'Gülle-Jaucheanfall-Daten'!$B$6:$H$148,7)","v":0},null,null,null,null,null,{"$f":"IF(I6>0,ROUND(+F6*J6*H6/I6,1),ROUND(F6*J6,1))","v":0},0,0,0]
[null,null,null,{"$f":"IF(C7=\"\",1,VLOOKUP(C7,'Gülle-Jaucheanfall-Daten'!$A$7:$B$143,2,FALSE))","v":1},{"$f":"VLOOKUP($D7,'Gülle-Jaucheanfall-Daten'!$B$6:$E$148,2)","v":"cbm/Platz"},{"$f":"VLOOKUP($D7,'Gülle-Jaucheanfall-Daten'!$B$6:$H$148,3)","v":0},{"$f":"VLOOKUP($D7,'Gülle-Jaucheanfall-Daten'!$B$6:$H$148,4)","v":0},{"$f":"VLOOKUP($D7,'Gülle-Jaucheanfall-Daten'!$B$6:$H$148,7)","v":0},null,null,null,null,null,0,0,0,0]
[null,null,null,{"$f":"IF(C8=\"\",1,VLOOKUP(C8,'Gülle-Jaucheanfall-Daten'!$A$7:$B$143,2,FALSE))","v":1},{"$f":"VLOOKUP($D8,'Gülle-Jaucheanfall-Daten'!$B$6:$E$148,2)","v":"cbm/Platz"},{"$f":"VLOOKUP($D8,'Gülle-Jaucheanfall-Daten'!$B$6:$H$148,3)","v":0},{"$f":"VLOOKUP($D8,'Gülle-Jaucheanfall-Daten'!$B$6:$H$148,4)","v":0},{"$f":"VLOOKUP($D8,'Gülle-Jaucheanfall-Daten'!$B$6:$H$148,7)","v":0},null,null,null,null,null,0,0,0,0]
[null,null,null,{"$f":"IF(C9=\"\",1,VLOOKUP(C9,'Gülle-Jaucheanfall-Daten'!$A$7:$B$143,2,FALSE))","v":1},{"$f":"VLOOKUP($D9,'Gülle-Jaucheanfall-Daten'!$B$6:$E$148,2)","v":"cbm/Platz"},{"$f":"VLOOKUP($D9,'Gülle-Jaucheanfall-Daten'!$B$6:$H$148,3)","v":0},{"$f":"VLOOKUP($D9,'Gülle-Jaucheanfall-Daten'!$B$6:$H$148,4)","v":0},{"$f":"VLOOKUP($D9,'Gülle-Jaucheanfall-Daten'!$B$6:$H$148,7)","v":0},null,null,null,null,null,0,0,0,0]
[null,null,null,{"$f":"IF(C10=\"\",1,VLOOKUP(C10,'Gülle-Jaucheanfall-Daten'!$A$7:$B$143,2,FALSE))","v":1},{"$f":"VLOOKUP($D10,'Gülle-Jaucheanfall-Daten'!$B$6:$E$148,2)","v":"cbm/Platz"},{"$f":"VLOOKUP($D10,'Gülle-Jaucheanfall-Daten'!$B$6:$H$148,3)","v":0},{"$f":"VLOOKUP($D10,'Gülle-Jaucheanfall-Daten'!$B$6:$H$148,4)","v":0},{"$f":"VLOOKUP($D10,'Gülle-Jaucheanfall-Daten'!$B$6:$H$148,7)","v":0},null,null,null,null,null,0,0,0,0]
[null,null,null,{"$f":"IF(C11=\"\",1,VLOOKUP(C11,'Gülle-Jaucheanfall-Daten'!$A$7:$B$143,2,FALSE))","v":1},{"$f":"VLOOKUP($D11,'Gülle-Jaucheanfall-Daten'!$B$6:$E$148,2)","v":"cbm/Platz"},{"$f":"VLOOKUP($D11,'Gülle-Jaucheanfall-Daten'!$B$6:$H$148,3)","v":0},{"$f":"VLOOKUP($D11,'Gülle-Jaucheanfall-Daten'!$B$6:$H$148,4)","v":0},{"$f":"VLOOKUP($D11,'Gülle-Jaucheanfall-Daten'!$B$6:$H$148,7)","v":0},null,null,null,null,null,0,0,0,0]
[null,null,null,{"$f":"IF(C12=\"\",1,VLOOKUP(C12,'Gülle-Jaucheanfall-Daten'!$A$7:$B$143,2,FALSE))","v":1},{"$f":"VLOOKUP($D12,'Gülle-Jaucheanfall-Daten'!$B$6:$E$148,2)","v":"cbm/Platz"},{"$f":"VLOOKUP($D12,'Gülle-Jaucheanfall-Daten'!$B$6:$H$148,3)","v":0},{"$f":"VLOOKUP($D12,'Gülle-Jaucheanfall-Daten'!$B$6:$H$148,4)","v":0},{"$f":"VLOOKUP($D12,'Gülle-Jaucheanfall-Daten'!$B$6:$H$148,7)","v":0},null,null,null,null,null,0,0,0,0]
[null,null,null,{"$f":"IF(C13=\"\",1,VLOOKUP(C13,'Gülle-Jaucheanfall-Daten'!$A$7:$B$143,2,FALSE))","v":1},{"$f":"VLOOKUP($D13,'Gülle-Jaucheanfall-Daten'!$B$6:$E$148,2)","v":"cbm/Platz"},{"$f":"VLOOKUP($D13,'Gülle-Jaucheanfall-Daten'!$B$6:$H$148,3)","v":0},{"$f":"VLOOKUP($D13,'Gülle-Jaucheanfall-Daten'!$B$6:$H$148,4)","v":0},{"$f":"VLOOKUP($D13,'Gülle-Jaucheanfall-Daten'!$B$6:$H$148,7)","v":0},null,null,null,null,null,0,0,0,0]
[null,null,null,{"$f":"IF(C14=\"\",1,VLOOKUP(C14,'Gülle-Jaucheanfall-Daten'!$A$7:$B$143,2,FALSE))","v":1},{"$f":"VLOOKUP($D14,'Gülle-Jaucheanfall-Daten'!$B$6:$E$148,2)","v":"cbm/Platz"},{"$f":"VLOOKUP($D14,'Gülle-Jaucheanfall-Daten'!$B$6:$H$148,3)","v":0},{"$f":"VLOOKUP($D14,'Gülle-Jaucheanfall-Daten'!$B$6:$H$148,4)","v":0},{"$f":"VLOOKUP($D14,'Gülle-Jaucheanfall-Daten'!$B$6:$H$148,7)","v":0},null,null,null,null,null,0,0,0,0]
[null,null,null,{"$f":"IF(C15=\"\",1,VLOOKUP(C15,'Gülle-Jaucheanfall-Daten'!$A$7:$B$143,2,FALSE))","v":1},{"$f":"VLOOKUP($D15,'Gülle-Jaucheanfall-Daten'!$B$6:$E$148,2)","v":"cbm/Platz"},{"$f":"VLOOKUP($D15,'Gülle-Jaucheanfall-Daten'!$B$6:$H$148,3)","v":0},{"$f":"VLOOKUP($D15,'Gülle-Jaucheanfall-Daten'!$B$6:$H$148,4)","v":0},{"$f":"VLOOKUP($D15,'Gülle-Jaucheanfall-Daten'!$B$6:$H$148,7)","v":0},null,null,null,null,null,0,0,0,0]
[null,null,null,{"$f":"IF(C16=\"\",1,VLOOKUP(C16,'Gülle-Jaucheanfall-Daten'!$A$7:$B$143,2,FALSE))","v":1},{"$f":"VLOOKUP($D16,'Gülle-Jaucheanfall-Daten'!$B$6:$E$148,2)","v":"cbm/Platz"},{"$f":"VLOOKUP($D16,'Gülle-Jaucheanfall-Daten'!$B$6:$H$148,3)","v":0},{"$f":"VLOOKUP($D16,'Gülle-Jaucheanfall-Daten'!$B$6:$H$148,4)","v":0},{"$f":"VLOOKUP($D16,'Gülle-Jaucheanfall-Daten'!$B$6:$H$148,7)","v":0},null,null,null,null,null,0,0,0,0]
[null,null,null,{"$f":"IF(C17=\"\",1,VLOOKUP(C17,'Gülle-Jaucheanfall-Daten'!$A$7:$B$143,2,FALSE))","v":1},{"$f":"VLOOKUP($D17,'Gülle-Jaucheanfall-Daten'!$B$6:$E$148,2)","v":"cbm/Platz"},{"$f":"VLOOKUP($D17,'Gülle-Jaucheanfall-Daten'!$B$6:$H$148,3)","v":0},{"$f":"VLOOKUP($D17,'Gülle-Jaucheanfall-Daten'!$B$6:$H$148,4)","v":0},{"$f":"VLOOKUP($D17,'Gülle-Jaucheanfall-Daten'!$B$6:$H$148,7)","v":0},null,null,null,null,null,0,0,0,0]
[null,null,null,{"$f":"IF(C18=\"\",1,VLOOKUP(C18,'Gülle-Jaucheanfall-Daten'!$A$7:$B$143,2,FALSE))","v":1},{"$f":"VLOOKUP($D18,'Gülle-Jaucheanfall-Daten'!$B$6:$E$148,2)","v":"cbm/Platz"},{"$f":"VLOOKUP($D18,'Gülle-Jaucheanfall-Daten'!$B$6:$H$148,3)","v":0},{"$f":"VLOOKUP($D18,'Gülle-Jaucheanfall-Daten'!$B$6:$H$148,4)","v":0},{"$f":"VLOOKUP($D18,'Gülle-Jaucheanfall-Daten'!$B$6:$H$148,7)","v":0},null,null,null,null,null,0,0,0,0]
[null,null,null,{"$f":"IF(C19=\"\",1,VLOOKUP(C19,'Gülle-Jaucheanfall-Daten'!$A$7:$B$143,2,FALSE))","v":1},{"$f":"VLOOKUP($D19,'Gülle-Jaucheanfall-Daten'!$B$6:$E$148,2)","v":"cbm/Platz"},{"$f":"VLOOKUP($D19,'Gülle-Jaucheanfall-Daten'!$B$6:$H$148,3)","v":0},{"$f":"VLOOKUP($D19,'Gülle-Jaucheanfall-Daten'!$B$6:$H$148,4)","v":0},{"$f":"VLOOKUP($D19,'Gülle-Jaucheanfall-Daten'!$B$6:$H$148,7)","v":0},null,null,null,null,null,0,0,0,0]
[null,null,null,{"$f":"IF(C20=\"\",1,VLOOKUP(C20,'Gülle-Jaucheanfall-Daten'!$A$7:$B$143,2,FALSE))","v":1},{"$f":"VLOOKUP($D20,'Gülle-Jaucheanfall-Daten'!$B$6:$E$148,2)","v":"cbm/Platz"},{"$f":"VLOOKUP($D20,'Gülle-Jaucheanfall-Daten'!$B$6:$H$148,3)","v":0},{"$f":"VLOOKUP($D20,'Gülle-Jaucheanfall-Daten'!$B$6:$H$148,4)","v":0},{"$f":"VLOOKUP($D20,'Gülle-Jaucheanfall-Daten'!$B$6:$H$148,7)","v":0},null,null,null,null,null,0,0,0,0]
{"$rows_left_out":20}
{"sheet":"Rechnung","index":4,"n_rows":37,"n_cols":14,"rows_kept":37,"cut":false,"hidden":true,"merged":[[5,13,5,14],[6,13,6,14],[3,6,3,9],[4,6,4,7],[4,8,4,9],[6,6,6,7],[6,8,6,9],[13,6,13,7],[13,8,13,9],[15,6,15,7],[15,8,15,9],[14,6,14,7],[14,8,14,9],[10,6,10,7],[10,8,10,9],[12,6,12,7],[12,8,12,9],[7,6,7,7],[7,8,7,9],[9,6,9,7],[9,8,9,9]]}
["Stickstoffanfall"]
[]
[]
[null,null,"Fläche","davon",null,"Bilanzfläche","Stickstoffanfall aus  Wi-Dung"]
[null,null,null,null,null,"fläche","Gülle ",null,"Gülle "]
[null,null,null,"ohne","ohne",null,"kg N gesamt brutto",null,"kg N gesamt netto"]
[null,null,"gesamt","Zu- und Abfuhr","Bilanzpflicht","gesamt",{"$f":"SUM('Anlage - Stickstoff'!I5:I38)","v":0},null,{"$f":"SUM('Anlage - Stickstoff'!K5:K38)","v":0}]
[null,null,"ha","ha",null,"ha","Festmist ",null,"Festmist "]
[null,"Ackerland",{"$f":"Betriebsdaten!H29","v":0},{"$f":"Betriebsdaten!H31","v":0},null,{"$f":"C9-D9","v":0},"kg N  gesamt brutto",null,"kg N gesamt netto"]
[null,"Grünland",{"$f":"Betriebsdaten!H33","v":0},{"$f":"Betriebsdaten!H35","v":0},{"$f":"Betriebsdaten!H36","v":0},{"$f":"C10-D10-E10","v":0},{"$f":"SUM('Anlage - Stickstoff'!J5:J38)","v":0},null,{"$f":"SUM('Anlage - Stickstoff'!L5:L38)","v":0}]
[null,"Gesamt LF",{"$f":"Betriebsdaten!H27","v":0},{"$f":"SUM(D9:D10)","v":0},{"$f":"SUM(E9:E10)","v":0},{"$f":"C11-D11-E11","v":0},"Wi-Dung gesamt ",null,"Wi-Dung gesamt "]
[null,null,null,null,null,null,"kg N  gesamt brutto",null,"kg N gesamt netto"]
[null,null,null,null,null,null,{"$f":"G10+G7","v":0},null,{"$f":"I10+I7","v":0}]
[null,null,null,null,null,null,"WiDu gesamt ",null,"WiDu gesamt "]
[null,null,null,null,null,null,"kg/ha N  gesamt brutto",null,"kg/ha N gesamt     netto"]
[null,null,null,null,null,null,{"$f":"ROUND(G13/F11,1)","v":{"$error":"#DIV/0!"}},null,{"$f":"ROUND(I13/F11,1)","v":{"$error":"#DIV/0!"}}]
[]
[]
[]
[]
{"$rows_left_out":18}
{"sheet":"Stickstoffdaten","index":5,"n_rows":212,"n_cols":6,"rows_kept":212,"cut":false,"hidden":true,"merged":[]}
[null,null,"Einheit","N","anrechenbare N-Menge"]
[null,null,null,"kg/Einheit","nach Lagerung"]
[null,null,null,null,"Gülle","and."]
[]
[]
[null,1,"kg/Platz",0]
["     Kälber; 0 - 16 Wochen (ohne Mastkälber), 80 kg Zuwachs, 3 Durchgänge/a (D)",2,"kg/Platz",15.3,0.85,0.7]
["Kälber; 0 - 3 Monate (ohne Mastkälber) (A)",3,"kg/Platz",15.4,0.85,0.7]
["Kälber; 3 - 6 Monate (ohne Mastkälber) (A)",4,"kg/Platz",44.6,0.85,0.7]
["     Kälber; 3 - 6 Monate Ackerfutterbau; mit Weide (ohne Mastkälber) (A)",5,"kg/Platz",32.6,0.85,0.7]
["     Kälber; 3 - 6 Monate Ackerfutterbau; Stallhaltung (ohne Mastkälber) (A)",6,"kg/Platz",26.6,0.85,0.7]
["     Kälber; 3 - 6 Monate Grünland - extensiv (ohne Mastkälber) (A)",7,"kg/Platz",40.6,0.85,0.7]
["     Kälber; 3 - 6 Monate Grünland - konventionell (ohne Mastkälber) (A)",8,"kg/Platz",44.6,0.85,0.7]
["Mastrind, Kalb; 0 - 3 Monate (A)",9,"kg/Platz",14.4,0.85,0.7]
["     Mastrind, Kalb; 0 - 3 Monate; bis 625 kg LM; 18 Monate (A)",10,"kg/Platz",14.4,0.85,0.7]
["     Mastrind, Kalb; 0 - 3 Monate; bis 700 kg LM; 18 Monate (A)",11,"kg/Platz",14.4,0.85,0.7]
["Mastrind, Kalb; 3 - 6 Monate (A)",12,"kg/Platz",25.7,0.85,0.7]
["     Mastrind, Kalb; 3 - 6 Monate; bis 625 kg LM; 18 Monate (A)",13,"kg/Platz",24.6,0.85,0.7]
["     Mastrind, Kalb; 3 - 6 Monate; bis 700 kg LM; 18 Monate (A)",14,"kg/Platz",25.7,0.85,0.7]
["Zuchtrinder; 0 - 6 Monate; allgemein",15,"kg/Platz",30,0.85,0.7]
{"$rows_left_out":193}
{"sheet":"Gülle-Jaucheanfall-Daten","index":6,"n_rows":143,"n_cols":8,"rows_kept":143,"cut":false,"hidden":true,"merged":[[1,5,2,5],[1,6,2,6],[3,5,3,6],[1,0,3,0],[1,2,3,2],[1,3,2,3],[1,4,2,4],[3,3,3,4]]}
["Anlage 1: Datenerfassungsbeleg für den Anfall von flüssigen Wirtschaftsdüngern "]
["Tierart",null,"Einheit","Gülle-anfall ","Jauche-anfall","Gülle-anfall ","Jauche-anfall","Gülle "]
[null,null,null,null,null,null,null,"TM"]
[null,null,null,"in 12 Monaten      je Stallplatz cbm",null,"in 6 Monaten      je Stallplatz cbm",null,"Standard"]
[]
[null,1,"cbm/Platz",{"$f":"F6*2","v":0},{"$f":"G6*2","v":0},0,0,0]
["     Kälber; 0 - 16 Wochen (ohne Mastkälber), 80 kg Zuwachs, 3 Durchgänge/a (D)",2,"cbm/Platz",{"$f":"F7*2","v":3},{"$f":"G7*2","v":1.2},1.5,0.6,6]
["Kälber; 0 - 3 Monate (ohne Mastkälber) (A)",3,"cbm/Platz",4.2,1.2,2.1,0.6,6]
["Kälber; 3 - 6 Monate (ohne Mastkälber) (A)",4,"cbm/Platz",4.2,1.2,2.1,0.6,6]
["     Kälber; 3 - 6 Monate Ackerfutterbau; mit Weide (ohne Mastkälber) (A)",5,"cbm/Platz",4.2,1.2,2.1,0.6]
["     Kälber; 3 - 6 Monate Ackerfutterbau; Stallhaltung (ohne Mastkälber) (A)",6,"cbm/Platz",4.2,1.2,2.1,0.6]
["     Kälber; 3 - 6 Monate Grünland - extensiv (ohne Mastkälber) (A)",7,"cbm/Platz",4.2,1.2,2.1,0.6]
["     Kälber; 3 - 6 Monate Grünland - konventionell (ohne Mastkälber) (A)",8,"cbm/Platz",4.2,1.2,2.1,0.6]
["Mastrind, Kalb; 0 - 3 Monate (A)",9,"cbm/Platz",3.36,1.32,1.68,0.66]
["     Mastrind, Kalb; 0 - 3 Monate; bis 625 kg LM; 18 Monate (A)",10,"cbm/Platz",3.36,1.32,1.68,0.66]
["     Mastrind, Kalb; 0 - 3 Monate; bis 700 kg LM; 18 Monate (A)",11,"cbm/Platz",3.36,1.32,1.68,0.66]
["Mastrind, Kalb; 3 - 6 Monate (A)",12,"cbm/Platz",4.2,1.32,2.1,0.66]
["     Mastrind, Kalb; 3 - 6 Monate; bis 625 kg LM; 18 Monate (A)",13,"cbm/Platz",4.2,1.32,2.1,0.66]
["     Mastrind, Kalb; 3 - 6 Monate; bis 700 kg LM; 18 Monate (A)",14,"cbm/Platz",4.2,1.36,2.1,0.68]
["Zuchtrinder; 0 - 6 Monate; allgemein",15,"cbm/Platz",3.78,1.28,1.89,0.64]
{"$rows_left_out":123}